{"text_format":"1","workbook":"xlsx","n_sheets":6,"sheets":["Turnierplan Eingabe Resultate","AUSWERTUNG VORRUNDE","Schiri-Zettel","Turnierplan nur für Ausdruck","Ranglisten","Hilfstabelle"],"not_rendered":{"charts":0,"images":2,"macros":1,"external_links":1,"defined_names":8,"comments":3,"pivot_tables":0},"unopened":[],"bounds":{"document_bytes":16777216,"sheet_cells":100000,"rows_first":2000,"rows_last":500,"rows_between":2000,"halvings":0,"cell_chars":16384,"cell_head_chars":4096},"cells_cut":0,"cells_raw":0,"read":"whole","date_system":"1900"}

{"sheet":"Turnierplan Eingabe Resultate","index":0,"n_rows":95,"n_cols":51,"rows_kept":95,"cut":false,"hidden":false,"merged":[[93,25,93,26],[0,13,0,19],[22,4,22,10],[22,11,22,17],[22,18,22,24],[2,13,5,31],[40,0,40,24],[50,0,50,24]]}
[null,null,null,null,null,null,null,null,null,null,null,null,null,"2018-06-09"]
[]
[null,null,null,null,null,null,null,null,null,null,null,null,null,"10. Unihockey Turnier"]
[]
[]
[]
["Turnierplan"]
[]
["Gruppe A",null,null,null,null,null,null,null,null,null,null,null,null,"Gruppe B",null,null,null,null,null,null,null,null,null,null,"Gruppe C",null,null,null,null,null,null,null,null,null,"Gruppe D1"]
[1,"=","Büspi Flyers 1",null,null,null,null,null,null,null,null,null,null,{"$f":"A13+1","v":5},"=","Rappi Jona Flames 1",null,null,null,null,null,null,null,null,{"$f":"N13+1","v":9},"=","btv chur unihockey 1",null,null,null,null,null,null,null,{"$f":"Y15+1","v":15},"=","UHC PSW"]
{"$rows_left_out":86}
{"sheet":"AUSWERTUNG VORRUNDE","index":1,"n_rows":214,"n_cols":60,"rows_kept":214,"cut":false,"hidden":false,"merged":[[38,35,38,36],[49,35,49,36]]}
[]
[null,"Auswertung Vorrunde"]
[null,null,null,null,null,null,null,null,null,null,null,null,null,null,null,null,null,null,null,null,null,null,null,null,null,null,null,null,null,null,null,null,null,null,null,null,null,null,null,null,null,null,null,null,null,null,null,null,null,null,null,null,null,null,null,"Bei Punktgleichheit, Mannschaften von Hand aufgrund der Direktbegegnung klassieren!"]
[null,{"$f":"'Turnierplan Eingabe Resultate'!A9","v":"Gruppe A"},null,null,{"$f":"A6","v":1},null,null,null,{"$f":"A7","v":2},null,null,null,{"$f":"A8","v":3},null,null,null,{"$f":"A9","v":4},null,null,null,{"$f":"A6","v":1},null,null,null,{"$f":"A7","v":2},null,null,null,{"$f":"A8","v":3},null,null,null,{"$f":"A9","v":4},null,null,null,{"$f":"A14","v":0},null,null,null,null,null,null,null,null,null,null,null,null,null,null,"P Dif","P","Rang"]
[null,null,{"$f":"B6","v":"Büspi Flyers 1"},null,null,"P",{"$f":"B7","v":"Special Alligators 1"},null,null,"P",{"$f":"B8","v":"Vindonissa Tigers"},null,null,"P",{"$f":"B9","v":"FC Zürisee 1"},null,null,"P",{"$f":"B6","v":"Büspi Flyers 1"},null,null,"P",{"$f":"B7","v":"Special Alligators 1"},null,null,"P",{"$f":"B8","v":"Vindonissa Tigers"},null,null,"P",{"$f":"B9","v":"FC Zürisee 1"},null,null,"P",null,null,null,"P",null,null,null,null," P+","P -","P Dif","Punkte","Gruppenrang A'"]
[{"$f":"'Turnierplan Eingabe Resultate'!A10","v":1},{"$f":"'Turnierplan Eingabe Resultate'!C10","v":"Büspi Flyers 1"},null,null,null,null,{"$f":"VLOOKUP($A6&\"-\"&I$4,Hilfstabelle!$A$3:$E$90,4,FALSE)","v":7},":",{"$f":"VLOOKUP($A6&\"-\"&I$4,Hilfstabelle!$A$3:$E$90,5,FALSE)","v":2},{"$f":"IF(OR(G6=\"\",I6=\"\"),\"\",IF(G6>I6,2,IF(G6=I6,1,0)))","v":2},{"$f":"VLOOKUP($A6&\"-\"&M$4,Hilfstabelle!$A$3:$E$90,4,FALSE)","v":4},":",{"$f":"VLOOKUP($A6&\"-\"&M$4,Hilfstabelle!$A$3:$E$90,5,FALSE)","v":1},{"$f":"IF(OR(K6=\"\",M6=\"\"),\"\",IF(K6>M6,2,IF(K6=M6,1,0)))","v":2},{"$f":"VLOOKUP($A6&\"-\"&Q$4,Hilfstabelle!$A$3:$E$90,4,FALSE)","v":4},":",{"$f":"VLOOKUP($A6&\"-\"&Q$4,Hilfstabelle!$A$3:$E$90,5,FALSE)","v":2},{"$f":"IF(OR(O6=\"\",Q6=\"\"),\"\",IF(O6>Q6,2,IF(O6=Q6,1,0)))","v":2},null,null,null,null,{"$f":"VLOOKUP(Y$4&\"-\"&$A6,Hilfstabelle!$A$3:$E$90,5,FALSE)","v":3},":",{"$f":"VLOOKUP(Y$4&\"-\"&$A6,Hilfstabelle!$A$3:$E$90,4,FALSE)","v":3},{"$f":"IF(OR(W6=\"\",Y6=\"\"),\"\",IF(W6>Y6,2,IF(W6=Y6,1,0)))","v":1},{"$f":"VLOOKUP(AC$4&\"-\"&$A6,Hilfstabelle!$A$3:$E$90,5,FALSE)","v":3},":",{"$f":"VLOOKUP(AC$4&\"-\"&$A6,Hilfstabelle!$A$3:$E$90,4,FALSE)","v":0},{"$f":"IF(OR(AA6=\"\",AC6=\"\"),\"\",IF(AA6>AC6,2,IF(AA6=AC6,1,0)))","v":2},{"$f":"VLOOKUP(AG$4&\"-\"&$A6,Hilfstabelle!$A$3:$E$90,5,FALSE)","v":3},":",{"$f":"VLOOKUP(AG$4&\"-\"&$A6,Hilfstabelle!$A$3:$E$90,4,FALSE)","v":3},{"$f":"IF(OR(AE6=\"\",AG6=\"\"),\"\",IF(AE6>AG6,2,IF(AE6=AG6,1,0)))","v":1},null,":",null,null,null,null,null,null,{"$f":"SUM(C6,G6,K6,O6,S6,W6,AA6,AE6,AM6)","v":24},{"$f":"SUM(E6,I6,M6,Q6,U6,Y6,AC6,AG6,AO6)","v":11},{"$f":"AQ6-AR6","v":13},{"$f":"SUM(F6,J6,N6,R6,V6,Z6,AD6,AH6,AL6)","v":10},{"$f":"_xlfn.RANK.EQ(AT6,$AT$6:$AT$14)","v":1},null,null,null,"Büspi Flyers 1",13,10,1,null,{"$f":"IF(AND(BA6=BA7,BA6<>\"\"),\"Achtung! Punktgleichheit\",\"\")","v":""}]
[{"$f":"'Turnierplan Eingabe Resultate'!A11","v":2},{"$f":"'Turnierplan Eingabe Resultate'!C11","v":"Special Alligators 1"},{"$f":"I6","v":2},":",{"$f":"G6","v":7},{"$f":"IF(OR(C7=\"\",E7=\"\"),\"\",IF(C7>E7,2,IF(C7=E7,1,0)))","v":0},null,null,null,null,{"$f":"VLOOKUP($A7&\"-\"&M$4,Hilfstabelle!$A$3:$E$90,4,FALSE)","v":4},":",{"$f":"VLOOKUP($A7&\"-\"&M$4,Hilfstabelle!$A$3:$E$90,5,FALSE)","v":1},{"$f":"IF(OR(K7=\"\",M7=\"\"),\"\",IF(K7>M7,2,IF(K7=M7,1,0)))","v":2},{"$f":"VLOOKUP($A7&\"-\"&Q$4,Hilfstabelle!$A$3:$E$90,4,FALSE)","v":3},":",{"$f":"VLOOKUP($A7&\"-\"&Q$4,Hilfstabelle!$A$3:$E$90,5,FALSE)","v":2},2,{"$f":"Y6","v":3},":",{"$f":"W6","v":3},{"$f":"IF(OR(S7=\"\",U7=\"\"),\"\",IF(S7>U7,2,IF(S7=U7,1,0)))","v":1},null,null,null,null,{"$f":"VLOOKUP(AC$4&\"-\"&$A7,Hilfstabelle!$A$3:$E$90,5,FALSE)","v":3},":",{"$f":"VLOOKUP(AC$4&\"-\"&$A7,Hilfstabelle!$A$3:$E$90,4,FALSE)","v":1},2,{"$f":"VLOOKUP(AG$4&\"-\"&$A7,Hilfstabelle!$A$3:$E$90,5,FALSE)","v":3},":",{"$f":"VLOOKUP(AG$4&\"-\"&$A7,Hilfstabelle!$A$3:$E$90,4,FALSE)","v":4},0,null,":",null,null,null,null,null,null,{"$f":"SUM(C7,G7,K7,O7,S7,W7,AA7,AE7,AM7)","v":18},{"$f":"SUM(E7,I7,M7,Q7,U7,Y7,AC7,AG7,AO7)","v":18},{"$f":"AQ7-AR7","v":0},{"$f":"SUM(F7,J7,N7,R7,V7,Z7,AD7,AH7,AP7)","v":7},3,null,null,null,"FC Zürisee 1",6,7,2,null,{"$f":"IF(AND(BA7=BA8,BA7<>\"\"),\"Achtung! Punktgleichheit\",\"\")","v":"Achtung! Punktgleichheit"}]
[{"$f":"'Turnierplan Eingabe Resultate'!A12","v":3},{"$f":"'Turnierplan Eingabe Resultate'!C12","v":"Vindonissa Tigers"},{"$f":"M6","v":1},":",{"$f":"K6","v":4},{"$f":"IF(OR(C8=\"\",E8=\"\"),\"\",IF(C8>E8,2,IF(C8=E8,1,0)))","v":0},{"$f":"M7","v":1},":",{"$f":"K7","v":4},{"$f":"IF(OR(G8=\"\",I8=\"\"),\"\",IF(G8>I8,2,IF(G8=I8,1,0)))","v":0},null,null,null,null,{"$f":"VLOOKUP($A8&\"-\"&Q$4,Hilfstabelle!$A$3:$E$90,4,FALSE)","v":1},":",{"$f":"VLOOKUP($A8&\"-\"&Q$4,Hilfstabelle!$A$3:$E$90,5,FALSE)","v":4},0,{"$f":"AC6","v":0},":",{"$f":"AA6","v":3},0,{"$f":"AC7","v":1},":",{"$f":"AA7","v":3},{"$f":"IF(OR(W8=\"\",Y8=\"\"),\"\",IF(W8>Y8,2,IF(W8=Y8,1,0)))","v":0},null,null,null,null,{"$f":"VLOOKUP(AG$4&\"-\"&$A8,Hilfstabelle!$A$3:$E$90,5,FALSE)","v":0},":",{"$f":"VLOOKUP(AG$4&\"-\"&$A8,Hilfstabelle!$A$3:$E$90,4,FALSE)","v":5},0,null,":",null,null,null,null,null,null,4,23,{"$f":"AQ8-AR8","v":-19},0,{"$f":"_xlfn.RANK.EQ(AT8,$AT$6:$AT$14)","v":4},null,null,null,"Special Alligators 1",0,7,3,null,""]
[{"$f":"'Turnierplan Eingabe Resultate'!A13","v":4},{"$f":"'Turnierplan Eingabe Resultate'!C13","v":"FC Zürisee 1"},{"$f":"Q6","v":2},":",{"$f":"O6","v":4},0,{"$f":"Q7","v":2},":",{"$f":"O7","v":3},0,{"$f":"Q8","v":4},":",{"$f":"O8","v":1},{"$f":"IF(OR(K9=\"\",M9=\"\"),\"\",IF(K9>M9,2,IF(K9=M9,1,0)))","v":2},null,null,null,null,{"$f":"AG6","v":3},":",{"$f":"AE6","v":3},1,{"$f":"AG7","v":4},":",{"$f":"AE7","v":3},2,{"$f":"AG8","v":5},":",{"$f":"AE8","v":0},{"$f":"IF(OR(AA9=\"\",AC9=\"\"),\"\",IF(AA9>AC9,2,IF(AA9=AC9,1,0)))","v":2},null,null,null,null,null,":",null,null,null,null,null,null,20,14,{"$f":"AQ9-AR9","v":6},7,2,null,null,null,"Vindonissa Tigers",-19,0,4]
[{"$f":"'Turnierplan Eingabe Resultate'!A14","v":0},{"$f":"'Turnierplan Eingabe Resultate'!C14","v":0},null,":",null,"",null,":",null,"",null,":",null,"",null,":",null,{"$f":"IF(OR(O10=\"\",Q10=\"\"),\"\",IF(O10>Q10,2,IF(O10=Q10,1,0)))","v":""},null,null,null,null,null,":",null,null,null,":",null,null,null,":",null,null,null,":",null,null,null,null,null,null,0,0,{"$f":"AQ10-AR10","v":0},0,null,null,null,null,0,0,0]
{"$rows_left_out":205}
{"sheet":"Schiri-Zettel","index":2,"n_rows":51,"n_cols":38,"rows_kept":51,"cut":false,"hidden":false,"merged":[[2,4,2,10],[2,16,2,22],[2,28,2,34]]}
[]
[]
[null,null,null,null,{"$f":"'Turnierplan Eingabe Resultate'!E23","v":"Halle 1"},null,null,null,null,null,null,null,null,null,null,null,{"$f":"'Turnierplan Eingabe Resultate'!L23","v":"Halle 2"},null,null,null,null,null,null,null,null,null,null,null,{"$f":"'Turnierplan Eingabe Resultate'!S23","v":"Halle 3"}]
["Runde",null,{"$f":"'Turnierplan Eingabe Resultate'!C24","v":"Zeit"},null,null,{"$f":"'Turnierplan Eingabe Resultate'!F24","v":"Spiel"},null,null,null,{"$f":"'Turnierplan Eingabe Resultate'!J24","v":"Res."},null,null,{"$f":"A4","v":"Runde"},null,{"$f":"C4","v":"Zeit"},null,null,{"$f":"'Turnierplan Eingabe Resultate'!M24","v":"Spiel"},null,null,null,{"$f":"'Turnierplan Eingabe Resultate'!Q24","v":"Res."},null,null,{"$f":"A4","v":"Runde"},null,{"$f":"C4","v":"Zeit"},null,null,{"$f":"'Turnierplan Eingabe Resultate'!T24","v":"Spiel"},null,null,null,{"$f":"'Turnierplan Eingabe Resultate'!X24","v":"Res."}]
[{"$f":"'Turnierplan Eingabe Resultate'!A25","v":1},{"$f":"'Turnierplan Eingabe Resultate'!B25","v":"09:00:00"},{"$f":"'Turnierplan Eingabe Resultate'!C25","v":"-"},{"$f":"'Turnierplan Eingabe Resultate'!D25","v":"09:12:00"},{"$f":"'Turnierplan nur für Ausdruck'!E25","v":"Special Alligators 2"},{"$f":"'Turnierplan Eingabe Resultate'!F25","v":":"},{"$f":"'Turnierplan nur für Ausdruck'!H25","v":"btv chur unihockey 1"},null,null,{"$f":"'Turnierplan Eingabe Resultate'!J25","v":":"},null,{"$f":"E3","v":"Halle 1"},1,{"$f":"B5","v":"09:00:00"},"-",{"$f":"D5","v":"09:12:00"},{"$f":"'Turnierplan nur für Ausdruck'!N25","v":"Schulheim  Chur"},{"$f":"'Turnierplan Eingabe Resultate'!M25","v":":"},{"$f":"'Turnierplan nur für Ausdruck'!Q25","v":"FC Zürisee 2"},null,null,{"$f":"'Turnierplan Eingabe Resultate'!Q25","v":":"},null,{"$f":"Q3","v":"Halle 2"},1,{"$f":"B5","v":"09:00:00"},"-",{"$f":"D5","v":"09:12:00"},{"$f":"'Turnierplan nur für Ausdruck'!X25","v":"Insieme Rheintal Gators"},{"$f":"'Turnierplan Eingabe Resultate'!T25","v":":"},{"$f":"'Turnierplan nur für Ausdruck'!AA25","v":"btv chur unihockey 3"},null,null,{"$f":"'Turnierplan Eingabe Resultate'!X25","v":":"},null,{"$f":"AC3","v":"Halle 3"}]
[]
[{"$f":"'Turnierplan Eingabe Resultate'!A26","v":2},{"$f":"'Turnierplan Eingabe Resultate'!B26","v":"09:15:00"},{"$f":"'Turnierplan Eingabe Resultate'!C26","v":"-"},{"$f":"'Turnierplan Eingabe Resultate'!D26","v":"09:27:00"},{"$f":"'Turnierplan nur für Ausdruck'!E26","v":"Büspi Flyers 1"},{"$f":"'Turnierplan Eingabe Resultate'!F26","v":":"},{"$f":"'Turnierplan nur für Ausdruck'!H26","v":"Special Alligators 1"},null,null,{"$f":"'Turnierplan Eingabe Resultate'!J26","v":":"},null,{"$f":"L$5","v":"Halle 1"},2,"09:15:00","-","09:27:00",{"$f":"'Turnierplan nur für Ausdruck'!N26","v":"Vindonissa Tigers"},{"$f":"'Turnierplan Eingabe Resultate'!M26","v":":"},{"$f":"'Turnierplan nur für Ausdruck'!Q26","v":"FC Zürisee 1"},null,null,{"$f":"'Turnierplan Eingabe Resultate'!Q26","v":":"},null,{"$f":"X$5","v":"Halle 2"},2,"09:15:00","-","09:27:00",{"$f":"'Turnierplan nur für Ausdruck'!X26","v":"Vindonissa Panthers"},{"$f":"'Turnierplan Eingabe Resultate'!T26","v":":"},{"$f":"'Turnierplan nur für Ausdruck'!AA26","v":"Rappi Jona Flames 2"},null,null,{"$f":"'Turnierplan Eingabe Resultate'!X26","v":":"},null,{"$f":"AJ$5","v":"Halle 3"}]
[]
[{"$f":"'Turnierplan Eingabe Resultate'!A27","v":3},{"$f":"'Turnierplan Eingabe Resultate'!B27","v":"09:30:00"},{"$f":"'Turnierplan Eingabe Resultate'!C27","v":"-"},{"$f":"'Turnierplan Eingabe Resultate'!D27","v":"09:42:00"},{"$f":"'Turnierplan nur für Ausdruck'!E27","v":"UHC PSW"},{"$f":"'Turnierplan Eingabe Resultate'!F27","v":":"},{"$f":"'Turnierplan nur für Ausdruck'!H27","v":"btv chur unihockey 2"},null,null,{"$f":"'Turnierplan Eingabe Resultate'!J27","v":":"},null,{"$f":"L$5","v":"Halle 1"},3,"09:30:00","-","09:42:00",{"$f":"'Turnierplan nur für Ausdruck'!N27","v":"Black Panthers"},{"$f":"'Turnierplan Eingabe Resultate'!M27","v":":"},{"$f":"'Turnierplan nur für Ausdruck'!Q27","v":"Bünzgeister"},null,null,{"$f":"'Turnierplan Eingabe Resultate'!Q27","v":":"},null,{"$f":"X$5","v":"Halle 2"},3,"09:30:00","-","09:42:00",{"$f":"'Turnierplan nur für Ausdruck'!X27","v":"Altra Ducks"},{"$f":"'Turnierplan Eingabe Resultate'!T27","v":":"},{"$f":"'Turnierplan nur für Ausdruck'!AA27","v":"Junkihüpfer Wohlen"},null,null,{"$f":"'Turnierplan Eingabe Resultate'!X27","v":":"},null,{"$f":"AJ$5","v":"Halle 3"},{"$f":"'Turnierplan nur für Ausdruck'!AK9","v":1},{"$f":"'Turnierplan nur für Ausdruck'!AL9","v":"Büspi Flyers 1"}]
[null,null,null,null,null,null,null,null,null,null,null,null,null,null,null,null,null,null,null,null,null,null,null,null,null,null,null,null,null,null,null,null,null,null,null,null,{"$f":"'Turnierplan nur für Ausdruck'!AK10","v":2},{"$f":"'Turnierplan nur für Ausdruck'!AL10","v":"Special Alligators 1"}]
{"$rows_left_out":42}
{"sheet":"Turnierplan nur für Ausdruck","index":3,"n_rows":51,"n_cols":38,"rows_kept":51,"cut":false,"hidden":false,"merged":[[50,0,50,31],[40,0,40,31],[25,4,25,5],[25,13,25,14],[28,4,28,5],[24,7,24,9],[0,13,0,22],[2,9,5,23],[22,4,22,12],[22,13,22,22],[22,23,22,31],[9,15,9,16],[10,15,10,16],[11,15,11,16],[12,15,12,16],[13,15,13,16],[14,15,14,16],[26,4,26,5],[26,13,26,14],[26,23,26,24],[25,7,25,9],[26,7,26,9],[26,16,26,19],[25,16,25,19],[28,7,28,9],[29,4,29,5],[29,7,29,9],[30,7,30,9],[31,7,31,9],[30,4,30,5],[31,4,31,5],[24,23,24,24],[24,4,24,5],[24,13,24,14],[27,4,27,5],[27,13,27,14],[25,23,25,24],[27,7,27,9],[27,16,27,19],[27,23,27,24],[28,23,28,24],[29,23,29,24],[30,23,30,24],[31,23,31,24],[24,16,24,19],[24,26,24,28],[25,26,25,28],[26,26,26,28],[27,26,27,28],[28,13,28,14],[29,13,29,14],[30,13,30,14],[31,13,31,14],[28,16,28,19],[29,16,29,19],[30,16,30,19],[31,16,31,19],[28,26,28,28],[29,26,29,28],[30,26,30,28],[31,26,31,28],[32,26,32,28],[33,4,33,5],[33,7,33,9],[33,13,33,14],[33,16,33,19],[33,23,33,24],[33,26,33,28],[32,4,32,5],[32,7,32,9],[32,13,32,14],[32,16,32,19],[32,23,32,24],[34,26,34,28],[35,4,35,5],[35,7,35,9],[35,13,35,14],[35,16,35,19],[35,23,35,24],[35,26,35,28],[34,4,34,5],[34,7,34,9],[34,13,34,14],[34,16,34,19],[34,23,34,24],[36,26,36,28],[37,4,37,5],[37,7,37,9],[37,13,37,14],[37,16,37,19],[37,23,37,24],[37,26,37,28],[36,4,36,5],[36,7,36,9],[36,13,36,14],[36,16,36,19],[36,23,36,24],[38,26,38,28],[39,4,39,5],[39,7,39,9],[39,13,39,14],[39,16,39,19],[39,23,39,24],[39,26,39,28],[38,4,38,5],[38,7,38,9],[38,13,38,14],[38,16,38,19],[38,23,38,24],[41,26,41,28],[42,4,42,5],[42,7,42,9],[42,13,42,14],[42,16,42,19],[42,23,42,24],[41,4,41,5],[41,7,41,9],[41,13,41,14],[41,16,41,19],[41,23,41,24],[43,26,43,28],[42,26,42,28],[44,4,44,5],[44,7,44,9],[44,13,44,14],[44,16,44,19],[44,23,44,24],[44,26,44,28],[43,4,43,5],[43,7,43,9],[43,13,43,14],[43,16,43,19],[43,23,43,24],[45,26,45,28],[46,4,46,5],[46,7,46,9],[46,13,46,14],[46,16,46,19],[46,23,46,24],[46,26,46,28],[45,4,45,5],[45,7,45,9],[45,13,45,14],[45,16,45,19],[45,23,45,24],[47,26,47,28],[48,4,48,5],[48,7,48,9],[48,13,48,14],[48,16,48,19],[48,23,48,24],[48,26,48,28],[47,4,47,5],[47,7,47,9],[47,13,47,14],[47,16,47,19],[47,23,47,24]]}
[null,null,null,null,null,null,null,null,null,null,null,null,null,{"$f":"'Turnierplan Eingabe Resultate'!N1","v":"2018-06-09"}]
[]
[null,null,null,null,null,null,null,null,null,{"$f":"'Turnierplan Eingabe Resultate'!N3","v":"10. Unihockey Turnier"}]
[]
[]
[]
[{"$f":"'Turnierplan Eingabe Resultate'!A7","v":"Turnierplan"}]
[]
[{"$f":"'Turnierplan Eingabe Resultate'!A9","v":"Gruppe A"},null,null,null,null,null,null,{"$f":"'Turnierplan Eingabe Resultate'!N9","v":"Gruppe B"},null,null,null,null,null,null,null,{"$f":"'Turnierplan Eingabe Resultate'!Y9","v":"Gruppe C"},null,null,null,null,null,null,null,null,{"$f":"'Turnierplan Eingabe Resultate'!AI9","v":"Gruppe D1"},null,null,null,null,null,null,null,{"$f":"'Turnierplan Eingabe Resultate'!AI19","v":"Gruppe D2"},null,null,null,1,{"$f":"'Turnierplan Eingabe Resultate'!C10","v":"Büspi Flyers 1"}]
[{"$f":"'Turnierplan Eingabe Resultate'!A10","v":1},"=",{"$f":"'Turnierplan Eingabe Resultate'!C10","v":"Büspi Flyers 1"},null,null,null,null,{"$f":"'Turnierplan Eingabe Resultate'!N10","v":5},"=",{"$f":"'Turnierplan Eingabe Resultate'!P10","v":"Rappi Jona Flames 1"},null,null,null,null,null,{"$f":"'Turnierplan Eingabe Resultate'!Y10","v":9},null,"=",{"$f":"'Turnierplan Eingabe Resultate'!AA10","v":"btv chur unihockey 1"},null,null,null,null,null,{"$f":"'Turnierplan Eingabe Resultate'!AI10","v":15},"=",{"$f":"'Turnierplan Eingabe Resultate'!AK10","v":"UHC PSW"},null,null,null,null,null,{"$f":"'Turnierplan Eingabe Resultate'!AI20","v":21},"=",{"$f":"'Turnierplan Eingabe Resultate'!AK20","v":"Insieme Rheintal Gators"},null,2,{"$f":"'Turnierplan Eingabe Resultate'!C11","v":"Special Alligators 1"}]
{"$rows_left_out":42}
{"sheet":"Ranglisten","index":4,"n_rows":42,"n_cols":2,"rows_kept":42,"cut":false,"hidden":false,"merged":[]}
["Gruppe A"]
["1. Rang",{"$f":"IF('AUSWERTUNG VORRUNDE'!AY6=\"\",\"\",'AUSWERTUNG VORRUNDE'!AY6)","v":"Büspi Flyers 1"}]
["2. Rang",{"$f":"IF('AUSWERTUNG VORRUNDE'!AY7=\"\",\"\",'AUSWERTUNG VORRUNDE'!AY7)","v":"FC Zürisee 1"}]
["3. Rang",{"$f":"IF('AUSWERTUNG VORRUNDE'!AY8=\"\",\"\",'AUSWERTUNG VORRUNDE'!AY8)","v":"Special Alligators 1"}]
["4. Rang",{"$f":"IF('AUSWERTUNG VORRUNDE'!AY9=\"\",\"\",'AUSWERTUNG VORRUNDE'!AY9)","v":"Vindonissa Tigers"}]
[]
[]
[]
["Gruppe B"]
["1. Rang",{"$f":"IF('AUSWERTUNG VORRUNDE'!AY19=\"\",\"\",'AUSWERTUNG VORRUNDE'!AY19)","v":"Junkihüpfer Wohlen"}]
{"$rows_left_out":33}
{"sheet":"Hilfstabelle","index":5,"n_rows":90,"n_cols":5,"rows_kept":90,"cut":false,"hidden":true,"merged":[]}
[]
[null,"gruppe1","gruppe2","resultat1","resultat2"]
[{"$f":"B3&\"-\"&C3","v":"10-9"},{"$f":"'Turnierplan Eingabe Resultate'!E25","v":10},{"$f":"'Turnierplan Eingabe Resultate'!G25","v":9},{"$f":"IF('Turnierplan Eingabe Resultate'!I25=\"\",\"\",'Turnierplan Eingabe Resultate'!I25)","v":3},{"$f":"IF('Turnierplan Eingabe Resultate'!K25=\"\",\"\",'Turnierplan Eingabe Resultate'!K25)","v":2}]
[{"$f":"B4&\"-\"&C4","v":"1-2"},{"$f":"'Turnierplan Eingabe Resultate'!E26","v":1},{"$f":"'Turnierplan Eingabe Resultate'!G26","v":2},{"$f":"IF('Turnierplan Eingabe Resultate'!I26=\"\",\"\",'Turnierplan Eingabe Resultate'!I26)","v":7},{"$f":"IF('Turnierplan Eingabe Resultate'!K26=\"\",\"\",'Turnierplan Eingabe Resultate'!K26)","v":2}]
["15-16",{"$f":"'Turnierplan Eingabe Resultate'!E27","v":15},{"$f":"'Turnierplan Eingabe Resultate'!G27","v":16},{"$f":"IF('Turnierplan Eingabe Resultate'!I27=\"\",\"\",'Turnierplan Eingabe Resultate'!I27)","v":5},{"$f":"IF('Turnierplan Eingabe Resultate'!K27=\"\",\"\",'Turnierplan Eingabe Resultate'!K27)","v":2}]
["13-14",{"$f":"'Turnierplan Eingabe Resultate'!E28","v":13},{"$f":"'Turnierplan Eingabe Resultate'!G28","v":14},{"$f":"IF('Turnierplan Eingabe Resultate'!I28=\"\",\"\",'Turnierplan Eingabe Resultate'!I28)","v":3},{"$f":"IF('Turnierplan Eingabe Resultate'!K28=\"\",\"\",'Turnierplan Eingabe Resultate'!K28)","v":2}]
["1-3",{"$f":"'Turnierplan Eingabe Resultate'!E29","v":1},{"$f":"'Turnierplan Eingabe Resultate'!G29","v":3},{"$f":"IF('Turnierplan Eingabe Resultate'!I29=\"\",\"\",'Turnierplan Eingabe Resultate'!I29)","v":4},{"$f":"IF('Turnierplan Eingabe Resultate'!K29=\"\",\"\",'Turnierplan Eingabe Resultate'!K29)","v":1}]
["5-7",{"$f":"'Turnierplan Eingabe Resultate'!E30","v":5},{"$f":"'Turnierplan Eingabe Resultate'!G30","v":7},{"$f":"IF('Turnierplan Eingabe Resultate'!I30=\"\",\"\",'Turnierplan Eingabe Resultate'!I30)","v":6},{"$f":"IF('Turnierplan Eingabe Resultate'!K30=\"\",\"\",'Turnierplan Eingabe Resultate'!K30)","v":4}]
["11-9",{"$f":"'Turnierplan Eingabe Resultate'!E31","v":11},{"$f":"'Turnierplan Eingabe Resultate'!G31","v":9},{"$f":"IF('Turnierplan Eingabe Resultate'!I31=\"\",\"\",'Turnierplan Eingabe Resultate'!I31)","v":2},{"$f":"IF('Turnierplan Eingabe Resultate'!K31=\"\",\"\",'Turnierplan Eingabe Resultate'!K31)","v":6}]
["15-17",{"$f":"'Turnierplan Eingabe Resultate'!E32","v":15},{"$f":"'Turnierplan Eingabe Resultate'!G32","v":17},{"$f":"IF('Turnierplan Eingabe Resultate'!I32=\"\",\"\",'Turnierplan Eingabe Resultate'!I32)","v":0},{"$f":"IF('Turnierplan Eingabe Resultate'!K32=\"\",\"\",'Turnierplan Eingabe Resultate'!K32)","v":2}]
{"$rows_left_out":80}